Reaction Details
TargetSodium- and chloride-dependent glycine transporter 1
LigandBDBM160585
Substrate/Competitorn/a
Meas. Tech.Radioligand Binding Assay
Ki<10000±n/a nM
Citation Pohlki, FLange, UAmberg, WOchse, MBehl, BHutchins, CWHornberger, WMezler, M Phenalkylamine derivatives, pharmaceutical compositions containing them, and their use in therapy US Patent US9045459 Publication Date 6/2/2015
 
Sodium- and chloride-dependent glycine transporter 1
Name:Sodium- and chloride-dependent glycine transporter 1
Type:Enzyme
Mol. Mass.:78270.54
Organism:Homo sapiens (Human)
Description:P48067
Residue:706
BDBM160585
NameBDBM160585
Synonyms:US9045459, 2
TypeSmall organic molecule
Emp. Form.C22H26N4O2S
Mol. Mass.410.532
SMILESCn1cc(cn1)S(=O)(=O)N1CCc2ccc(cc2C1)C(CN)Cc1ccccc1