Reaction Details
TargetSodium- and chloride-dependent glycine transporter 1
LigandBDBM160586
Substrate/Competitorn/a
Meas. Tech.Radioligand Binding Assay
Ki<10000±n/a nM
Citation Pohlki, FLange, UAmberg, WOchse, MBehl, BHutchins, CWHornberger, WMezler, M Phenalkylamine derivatives, pharmaceutical compositions containing them, and their use in therapy US Patent US9045459 Publication Date 6/2/2015
 
Sodium- and chloride-dependent glycine transporter 1
Name:Sodium- and chloride-dependent glycine transporter 1
Type:Enzyme
Mol. Mass.:78270.54
Organism:Homo sapiens (Human)
Description:P48067
Residue:706
BDBM160586
NameBDBM160586
Synonyms:US9045459, 3
TypeSmall organic molecule
Emp. Form.C22H28N2O2S
Mol. Mass.384.535
SMILESNCC(Cc1ccccc1)c1ccc2CCN(Cc2c1)S(=O)(=O)CC1CC1