Reaction Details
TargetCaspase-2
LigandBDBM160849
Substrate/Competitorn/a
Meas. Tech.Fluorometric Enzymatic Assay
IC50>3330±n/a nM
Citation Ahlfors, JMekouar, K Selective caspase inhibitors and uses thereof US Patent US9045524 Publication Date 6/2/2015
 
Caspase-2
Name:Caspase-2
Type:Enzyme
Mol. Mass.:50688.29
Organism:Homo sapiens (Human)
Description:P42575
Residue:452
BDBM160849
NameBDBM160849
Synonyms:US9045524, 123
TypeSmall organic molecule
Emp. Form.C31H37ClN4O11S
Mol. Mass.709.164
SMILESCC(C)[C@H](NC(=O)[C@@H](NC(=O)[C@H](CC(O)=O)NC(=O)OCc1ccccc1)c1ccccc1)C(=O)N[C@@H](CC(O)=O)\C=C(/Cl)S(C)(=O)=O