Reaction Details
TargetSodium channel protein type 10 subunit alpha
LigandBDBM160956
Substrate/Competitorn/a
Meas. Tech.Electrophysiology Assay
IC50 27±n/a nM
Citation Hadida-Ruah, SSAnderson, CArumugam, VAsgian, ILBear, BRTermin, APJohnson, JP Amides as modulators of sodium channels US Patent US9108903 Publication Date 8/18/2015
 
Sodium channel protein type 10 subunit alpha
Name:Sodium channel protein type 10 subunit alpha
Type:Enzyme
Mol. Mass.:219724.17
Organism:Rattus norvegicus (Rat)
Description:Q62968
Residue:1956
BDBM160956
NameBDBM160956
Synonyms:US9108903, 21
TypeSmall organic molecule
Emp. Form.C22H17Cl2NO6
Mol. Mass.462.279
SMILESCOc1cc(CO)ccc1Oc1cc(Cl)c(Cl)cc1C(=O)Nc1ccc(cc1)C(O)=O