Reaction Details
TargetSodium channel protein type 10 subunit alpha
LigandBDBM160976
Substrate/Competitorn/a
Meas. Tech.Electrophysiology Assay
IC50 12±n/a nM
Citation Hadida-Ruah, SSAnderson, CArumugam, VAsgian, ILBear, BRTermin, APJohnson, JP Amides as modulators of sodium channels US Patent US9108903 Publication Date 8/18/2015
 
Sodium channel protein type 10 subunit alpha
Name:Sodium channel protein type 10 subunit alpha
Type:Enzyme
Mol. Mass.:219724.17
Organism:Rattus norvegicus (Rat)
Description:Q62968
Residue:1956
BDBM160976
NameBDBM160976
Synonyms:US9108903, 41
TypeSmall organic molecule
Emp. Form.C19H10Cl3FN2O4
Mol. Mass.455.651
SMILESOC(=O)c1ccc(NC(=O)c2cc(Cl)c(Cl)cc2Oc2ccc(F)cc2Cl)cn1