Reaction Details
TargetSodium channel protein type 10 subunit alpha
LigandBDBM160984
Substrate/Competitorn/a
Meas. Tech.Electrophysiology Assay
IC50 6±n/a nM
Citation Hadida-Ruah, SSAnderson, CArumugam, VAsgian, ILBear, BRTermin, APJohnson, JP Amides as modulators of sodium channels US Patent US9108903 Publication Date 8/18/2015
 
Sodium channel protein type 10 subunit alpha
Name:Sodium channel protein type 10 subunit alpha
Type:Enzyme
Mol. Mass.:219724.17
Organism:Rattus norvegicus (Rat)
Description:Q62968
Residue:1956
BDBM160984
NameBDBM160984
Synonyms:US9108903, 49
TypeSmall organic molecule
Emp. Form.C23H16F6N2O6
Mol. Mass.530.3734
SMILESCOc1cc(CO)ccc1Oc1cc(cc(c1C(=O)Nc1ccc(nc1)C(O)=O)C(F)(F)F)C(F)(F)F