Reaction Details
TargetSodium channel protein type 10 subunit alpha
LigandBDBM160989
Substrate/Competitorn/a
Meas. Tech.Electrophysiology Assay
IC50 180±n/a nM
Citation Hadida-Ruah, SSAnderson, CArumugam, VAsgian, ILBear, BRTermin, APJohnson, JP Amides as modulators of sodium channels US Patent US9108903 Publication Date 8/18/2015
 
Sodium channel protein type 10 subunit alpha
Name:Sodium channel protein type 10 subunit alpha
Type:Enzyme
Mol. Mass.:219724.17
Organism:Rattus norvegicus (Rat)
Description:Q62968
Residue:1956
BDBM160989
NameBDBM160989
Synonyms:US9108903, 54
TypeSmall organic molecule
Emp. Form.C23H21FN2O4
Mol. Mass.408.4222
SMILESCC(C)(C)c1ccc(C(=O)Nc2ccc(nc2)C(O)=O)c(Oc2ccc(F)cc2)c1