Reaction Details
TargetSodium channel protein type 10 subunit alpha
LigandBDBM160999
Substrate/Competitorn/a
Meas. Tech.Electrophysiology Assay
IC50 755±n/a nM
Citation Hadida-Ruah, SSAnderson, CArumugam, VAsgian, ILBear, BRTermin, APJohnson, JP Amides as modulators of sodium channels US Patent US9108903 Publication Date 8/18/2015
 
Sodium channel protein type 10 subunit alpha
Name:Sodium channel protein type 10 subunit alpha
Type:Enzyme
Mol. Mass.:219724.17
Organism:Rattus norvegicus (Rat)
Description:Q62968
Residue:1956
BDBM160999
NameBDBM160999
Synonyms:US9108903, 64
TypeSmall organic molecule
Emp. Form.C23H19F3N2O5
Mol. Mass.460.4026
SMILESCC(C)Oc1ccccc1Oc1ccc(cc1C(=O)Nc1ccc(nc1)C(O)=O)C(F)(F)F