Reaction Details
TargetSodium channel protein type 10 subunit alpha
LigandBDBM161005
Substrate/Competitorn/a
Meas. Tech.Electrophysiology Assay
IC50 985±n/a nM
Citation Hadida-Ruah, SSAnderson, CArumugam, VAsgian, ILBear, BRTermin, APJohnson, JP Amides as modulators of sodium channels US Patent US9108903 Publication Date 8/18/2015
 
Sodium channel protein type 10 subunit alpha
Name:Sodium channel protein type 10 subunit alpha
Type:Enzyme
Mol. Mass.:219724.17
Organism:Rattus norvegicus (Rat)
Description:Q62968
Residue:1956
BDBM161005
NameBDBM161005
Synonyms:US9108903, 70
TypeSmall organic molecule
Emp. Form.C20H13F3N2O4
Mol. Mass.402.3234
SMILESOC(=O)c1ccc(NC(=O)c2cc(ccc2Oc2ccccc2)C(F)(F)F)cn1