Reaction Details
TargetFibroblast growth factor receptor 2
LigandBDBM161439
Substrate/Competitorn/a
Meas. Tech.Inhibition Assay
pH7.5±n/a
Temperature298.15±n/a K
IC50 1±n/a nM
Commentsextracted
Citation Sagara, TIto, SOtsuki, SSootome, H 3,5-disubstituted alkynylbenzene compound and salt thereof US Patent US9108973 Publication Date 8/18/2015
 
Fibroblast growth factor receptor 2
Name:Fibroblast growth factor receptor 2
Type:Enzyme
Mol. Mass.:92015.45
Organism:Homo sapiens (Human)
Description:P21802
Residue:821
BDBM161439
NameBDBM161439
Synonyms:US10124003, Ex. Compound 52 US9108973, 52 US9108973, 56
TypeSmall organic molecule
Emp. Form.C25H28N6O3
Mol. Mass.460.5282
SMILESCOc1cc(OC)cc(c1)C#Cc1cn(C2CN(C2)C(=O)\C=C\CN(C)C)c2ncnc(N)c12