Reaction Details
TargetFibroblast growth factor receptor 3
LigandBDBM161438
Substrate/Competitorn/a
Meas. Tech.Inhibition Assay
IC50 0.1±n/a nM
Citation Sagara, TIto, SOtsuki, SSootome, H 3,5-disubstituted alkynylbenzene compound and salt thereof US Patent US9108973 Publication Date 8/18/2015
 
Fibroblast growth factor receptor 3
Name:Fibroblast growth factor receptor 3
Type:Protein
Mol. Mass.:87699.57
Organism:Homo sapiens (Human)
Description:P22607
Residue:806
BDBM161438
NameBDBM161438
Synonyms:US10124003, Ex. Compound 51 US9108973, 51
TypeSmall organic molecule
Emp. Form.C22H23N5O3
Mol. Mass.405.4497
SMILESCOc1cc(OC)cc(c1)C#CC1=CN(C2CN(C2)C(=O)C=C)C2N=CN=C(N)C12