Reaction Details
TargetMitogen-activated protein kinase kinase kinase 5
LigandBDBM162321
Substrate/Competitorn/a
Meas. Tech.Time-Resolved Fluorescence Resonance Energy Transfer (TR-FRET) Assay
IC50 2±0.0 nM
Citation Notte, G Apoptosis signal-regulating kinase inhibitors US Patent US9051313 Publication Date 6/9/2015
 
Mitogen-activated protein kinase kinase kinase 5
Name:Mitogen-activated protein kinase kinase kinase 5
Type:Protein
Mol. Mass.:154514.93
Organism:Homo sapiens (Human)
Description:Q99683
Residue:1374
BDBM162321
NameBDBM162321
Synonyms:US10307427, Compound 12 | US9051313, 12
TypeSmall organic molecule
Emp. Form.C25H27N9OS
Mol. Mass.501.607
SMILESO=C(Nc1csc(n1)-c1nncn1C1CC1)c1cc(c(cn1)N1CCCCC1)-n1cnc(c1)C1CC1