Reaction Details
TargetMitogen-activated protein kinase kinase kinase 5
LigandBDBM162322
Substrate/Competitorn/a
Meas. Tech.Time-Resolved Fluorescence Resonance Energy Transfer (TR-FRET) Assay
IC50 0.7±0.0 nM
Citation Notte, G Apoptosis signal-regulating kinase inhibitors US Patent US9051313 Publication Date 6/9/2015
 
Mitogen-activated protein kinase kinase kinase 5
Name:Mitogen-activated protein kinase kinase kinase 5
Type:Protein
Mol. Mass.:154514.93
Organism:Homo sapiens (Human)
Description:Q99683
Residue:1374
BDBM162322
NameBDBM162322
Synonyms:US10307427, Compound 13 | US9051313, 13
TypeSmall organic molecule
Emp. Form.C25H26F3N9OS
Mol. Mass.557.594
SMILESC[C@H](n1cnnc1-c1nc(NC(=O)c2cc(c(cn2)N2CCCCC2)-n2cnc(c2)C2CC2)cs1)C(F)(F)F