Reaction Details
TargetDipeptidyl peptidase 4
LigandBDBM162376
Substrate/Competitorn/a
Meas. Tech.Enzyme Inhibition Assay
pH7.5±n/a
Temperature310.15±n/a K
IC50 27.4±n/a nM
Commentsextracted
Citation Wu, W Tricyclic heterocycles useful as dipeptidyl peptidase-IV inhibitors US Patent US9051329 Publication Date 6/9/2015
 
Dipeptidyl peptidase 4
Name:Dipeptidyl peptidase 4
Type:Enzyme
Mol. Mass.:88271.01
Organism:Homo sapiens (Human)
Description:P27487
Residue:766
BDBM162376
NameBDBM162376
Synonyms:US9051329, Example 1 | US9051329, Example 4
TypeSmall organic molecule
Emp. Form.C21H21F4N7O2
Mol. Mass.479.4308
SMILESCN1C(=O)Cn2c1nc1nc(N3CCC[C@@H](N)C3)n(Cc3cc(F)ccc3C(F)(F)F)c1c2=O