Reaction Details
TargetDipeptidyl peptidase 4
LigandBDBM162380
Substrate/Competitorn/a
Meas. Tech.Enzyme Inhibition Assay
pH7.5±n/a
Temperature310.15±n/a K
IC50 123±n/a nM
Commentsextracted
Citation Wu, W Tricyclic heterocycles useful as dipeptidyl peptidase-IV inhibitors US Patent US9051329 Publication Date 6/9/2015
 
Dipeptidyl peptidase 4
Name:Dipeptidyl peptidase 4
Type:Enzyme
Mol. Mass.:88271.01
Organism:Homo sapiens (Human)
Description:P27487
Residue:766
BDBM162380
NameBDBM162380
Synonyms:US9051329, Example 5
TypeSmall organic molecule
Emp. Form.C17H21N7O2
Mol. Mass.355.3943
SMILESCC#CCn1c(nc2nc3N(C)C(=O)Cn3c(=O)c12)N1CCC[C@@H](N)C1