Reaction Details
TargetHistone deacetylase 1
LigandBDBM162855
Substrate/Competitorn/a
Meas. Tech.Inhibition Assay
pH8±n/a
Temperature298.15±n/a K
IC50 5100±n/a nM
Commentsextracted
Citation Hebach, CJoly, EKallen, JTernois, JGTintelnot-Blomley, M Trifluoromethyl-oxadiazole derivatives and their use in the treatment of disease US Patent US9056843 Publication Date 6/16/2015
 
Histone deacetylase 1
Name:Histone deacetylase 1
Type:Enzyme
Mol. Mass.:55090.27
Organism:Homo sapiens (Human)
Description:Q13547
Residue:482
BDBM162855
NameBDBM162855
Synonyms:US9056843, 146
TypeSmall organic molecule
Emp. Form.C18H22F4N4O2
Mol. Mass.402.3865
SMILESCCCN(CC)C[C@@H](C)NC(=O)c1ccc(cc1F)-c1noc(n1)C(F)(F)F