Reaction Details
TargetHistone deacetylase 4
LigandBDBM162862
Substrate/Competitorn/a
Meas. Tech.Inhibition Assay
pH8±n/a
Temperature298.15±n/a K
IC50 3.6±n/a nM
Commentsextracted
Citation Hebach, CJoly, EKallen, JTernois, JGTintelnot-Blomley, M Trifluoromethyl-oxadiazole derivatives and their use in the treatment of disease US Patent US9056843 Publication Date 6/16/2015
 
Histone deacetylase 4
Name:Histone deacetylase 4
Type:Enzyme
Mol. Mass.:119049.39
Organism:Homo sapiens (Human)
Description:P56524
Residue:1084
BDBM162862
NameBDBM162862
Synonyms:US9056843, 153
TypeSmall organic molecule
Emp. Form.C15H15F3N4O2
Mol. Mass.340.3004
SMILESCN1CC[C@H](C1)NC(=O)c1ccc(cc1)-c1noc(n1)C(F)(F)F