Reaction Details
TargetRhomboid protease AarA
LigandBDBM50199883
Substrate/Competitorn/a
Meas. Tech.Activity-based Protein Profiling (ABPP)
pH7.4±0
Temperature310.15±0 K
IC50 1.0e+4± 2e+3 nM
Citation Wolf, EVZeissler, AVerhelst, SH Inhibitor Fingerprinting of Rhomboid Proteases by Activity-Based Protein Profiling Reveals Inhibitor Selectivity and Rhomboid Autoprocessing. ACS Chem Biol10:2325-33 (2015) 
 
Rhomboid protease AarA
Name:Rhomboid protease AarA
Type:Protein
Mol. Mass.:31111.13
Organism:Providencia stuartii (Enterobacteria)
Description:P46116
Residue:281
BDBM50199883
NameBDBM50199883
Synonyms:3,4‐Dichloroisocoumarin (2) 3,4-dichloro-1H-isochromen-1-one CHEMBL24983 | cid_1609
TypeSmall organic molecule
Emp. Form.C9H4Cl2O2
Mol. Mass.215.033
SMILESClc1oc(=O)c2ccccc2c1Cl