Reaction Details
TargetRhomboid protease GlpG
LigandBDBM50199883
Substrate/Competitorn/a
Meas. Tech.Activity-based Protein Profiling (ABPP)
pH7.4±0
Temperature310.15±0 K
IC50 6.6e+2± 1.0e+2 nM
Citation Wolf, EVZeissler, AVerhelst, SH Inhibitor Fingerprinting of Rhomboid Proteases by Activity-Based Protein Profiling Reveals Inhibitor Selectivity and Rhomboid Autoprocessing. ACS Chem Biol10:2325-33 (2015) 
 
Rhomboid protease GlpG
Name:Rhomboid protease GlpG
Synonyms:Rhomboid protease (HiGlpG)
Type:Protein
Mol. Mass.:21622.69
Organism:Haemophilus influenzae (g-Proteobacteria)
Description:n/a
Residue:192
BDBM50199883
NameBDBM50199883
TypeSmall organic molecule
Emp. Form.C9H4Cl2O2
Mol. Mass.215.033
SMILESClc1oc(=O)c2ccccc2c1Cl