Reaction Details
TargetRhomboid protease GluP [F193S,L370F,L379S,R499W]
LigandBDBM165194
Substrate/Competitorn/a
Meas. Tech.Activity-based Protein Profiling (ABPP)
pH7.4±0
Temperature310.15±0 K
IC50 2.5e+4± 6e+3 nM
Citation Wolf, EVZeissler, AVerhelst, SH Inhibitor Fingerprinting of Rhomboid Proteases by Activity-Based Protein Profiling Reveals Inhibitor Selectivity and Rhomboid Autoprocessing. ACS Chem Biol10:2325-33 (2015) 
 
Rhomboid protease GluP [F193S,L370F,L379S,R499W]
Name:Rhomboid protease GluP [F193S,L370F,L379S,R499W]
Type:Protein
Mol. Mass.:56433.35
Organism:Bacillus subtilis (Firmicutes)
Description:P54493[F193S,L370F,L379S,R499W]
Residue:507
BDBM165194
NameBDBM165194
Synonyms:4‐Chloro‐7‐nitro‐3‐[(5‐phenylpentyl)oxy]isochromen‐1‐one (21)
TypeSmall organic molecule
Emp. Form.C20H18ClNO5
Mol. Mass.387.814
SMILES[O-][N+](=O)c1ccc2c(Cl)c(OCCCCCc3ccccc3)oc(=O)c2c1