Reaction Details
TargetRhomboid domain-containing protein
LigandBDBM165197
Substrate/Competitorn/a
Meas. Tech.Activity-based Protein Profiling (ABPP)
pH7.4±0
Temperature310.15±0 K
IC50 4.8e+4± 1.0e+4 nM
Citation Wolf, EVZeissler, AVerhelst, SH Inhibitor Fingerprinting of Rhomboid Proteases by Activity-Based Protein Profiling Reveals Inhibitor Selectivity and Rhomboid Autoprocessing. ACS Chem Biol10:2325-33 (2015) 
 
Rhomboid domain-containing protein
Name:Rhomboid domain-containing protein
Synonyms:Rhomboid protease (TmROM)
Type:Protein
Mol. Mass.:26404.64
Organism:Thermotoga maritima (Thermotogales)
Description:Q9WZ53
Residue:235
BDBM165197
NameBDBM165197
Synonyms:(4S)‐3‐butyl‐4‐(pent‐4‐yn‐1‐yl)oxetan‐2‐one (48)
TypeSmall organic molecule
Emp. Form.C12H18O2
Mol. Mass.194.2701
SMILESCCCC[C@H]1[C@H](CCCC#C)OC1=O