Reaction Details
TargetRhomboid protease GlpG
LigandBDBM165197
Substrate/Competitorn/a
Meas. Tech.Activity-based Protein Profiling (ABPP)
pH7.4±0
Temperature310.15±0 K
IC50 4.4e+4± 6e+3 nM
Citation Wolf, EVZeissler, AVerhelst, SH Inhibitor Fingerprinting of Rhomboid Proteases by Activity-Based Protein Profiling Reveals Inhibitor Selectivity and Rhomboid Autoprocessing. ACS Chem Biol10:2325-33 (2015) 
 
Rhomboid protease GlpG
Name:Rhomboid protease GlpG
Type:Protein
Mol. Mass.:31313.89
Organism:Escherichia coli (Enterobacteria)
Description:P09391
Residue:276
BDBM165197
NameBDBM165197
Synonyms:(4S)‐3‐butyl‐4‐(pent‐4‐yn‐1‐yl)oxetan‐2‐one (48)
TypeSmall organic molecule
Emp. Form.C12H18O2
Mol. Mass.194.2701
SMILESCCCC[C@H]1[C@H](CCCC#C)OC1=O