Reaction Details
TargetN-glycosylase/DNA lyase
LigandBDBM163686
Substrate/Competitorn/a
Meas. Tech.Fluorescence-based Assay
pH7.5±n/a
Temperature310.15±n/a K
IC50 1.56e+3± 2e+2 nM
Commentsextracted
Citation Donley, NJaruga, PCoskun, EDizdaroglu, MMcCullough, AKLloyd, RS Small Molecule Inhibitors of 8-Oxoguanine DNA Glycosylase-1 (OGG1). ACS Chem Biol10:2334-43 (2015) 
 
N-glycosylase/DNA lyase
Name:N-glycosylase/DNA lyase
Type:Protein
Mol. Mass.:38794.33
Organism:Homo sapiens (Human)
Description:O15527
Residue:345
BDBM163686
NameBDBM163686
Synonyms:2‐(Naphthalen‐1‐yloxy)acetohydrazide (040)
TypeSmall organic molecule
Emp. Form.C12H12N2O2
Mol. Mass.216.2359
SMILESNNC(=O)COc1cccc2ccccc12