Reaction Details
TargetcAMP and cAMP-inhibited cGMP 3',5'-cyclic phosphodiesterase 10A
LigandBDBM163722
Substrate/Competitorn/a
Meas. Tech.Inhibition Assay
Ki 0.03±n/a nM
Citation Cox, CDDudkin, VYKern, JLayton, MERaheem, IT Pyrimidine PDE10 inhibitors US Patent US9062059 Publication Date 6/23/2015
 
cAMP and cAMP-inhibited cGMP 3',5'-cyclic phosphodiesterase 10A
Name:cAMP and cAMP-inhibited cGMP 3',5'-cyclic phosphodiesterase 10A
Type:Protein
Mol. Mass.:88412.52
Organism:Homo sapiens (Human)
Description:Q9Y233
Residue:1055
BDBM163722
NameBDBM163722
Synonyms:US9062059, 1-2
TypeSmall organic molecule
Emp. Form.C19H22N6O
Mol. Mass.350.4176
SMILESCc1nc(NCc2cnn(C)c2)cc(OC[C@H]2C[C@@H]2c2ccccn2)n1