Reaction Details
TargetcAMP and cAMP-inhibited cGMP 3',5'-cyclic phosphodiesterase 10A
LigandBDBM163726
Substrate/Competitorn/a
Meas. Tech.Inhibition Assay
Ki 0.02±n/a nM
Citation Cox, CDDudkin, VYKern, JLayton, MERaheem, IT Pyrimidine PDE10 inhibitors US Patent US9062059 Publication Date 6/23/2015
 
cAMP and cAMP-inhibited cGMP 3',5'-cyclic phosphodiesterase 10A
Name:cAMP and cAMP-inhibited cGMP 3',5'-cyclic phosphodiesterase 10A
Type:Protein
Mol. Mass.:88412.52
Organism:Homo sapiens (Human)
Description:Q9Y233
Residue:1055
BDBM163726
NameBDBM163726
Synonyms:US9062059, 2-27
TypeSmall organic molecule
Emp. Form.C21H21N7OS
Mol. Mass.419.503
SMILESCc1nnc(CNc2cc(OC[C@H]3C[C@@H]3c3ccc4ncccc4n3)nc(C)n2)s1