Reaction Details
TargetcAMP and cAMP-inhibited cGMP 3',5'-cyclic phosphodiesterase 10A
LigandBDBM127934
Substrate/Competitorn/a
Meas. Tech.Inhibition Assay
Temperature298.15±n/a K
IC50 0.44±n/a nM
Commentsextracted
Citation Kehler, JNielsen, JMarigo, MKilburn, JPLanggård, M Substituted imidazo[2,1-A]isoindoles as PDE10 inhibitors US Patent US9062060 Publication Date 6/23/2015
 
cAMP and cAMP-inhibited cGMP 3',5'-cyclic phosphodiesterase 10A
Name:cAMP and cAMP-inhibited cGMP 3',5'-cyclic phosphodiesterase 10A
Type:Protein
Mol. Mass.:88412.52
Organism:Homo sapiens (Human)
Description:Q9Y233
Residue:1055
BDBM127934
NameBDBM127934
Synonyms:US8796304, 2-[2-(5,8-Dimethyl-[1,2,4]triazolo[1,5-a]pyrazin-2-yl)-ethyl]-6-methoxy-5H-imidazo[2,1-a]isoindole | US9062060, Table 1, Compound 15
TypeSmall organic molecule
Emp. Form.C20H20N6O
Mol. Mass.360.4124
SMILESCOc1cccc-2c1Cn1cc(CCc3nc4c(C)ncc(C)n4n3)nc-21