Reaction Details
TargetATP-sensitive inward rectifier potassium channel 1
LigandBDBM163766
Substrate/Competitorn/a
Meas. Tech.Electrophysiology Assay
pH7.4±n/a
IC50 80±n/a nM
Commentsextracted
Citation Pasternak, ABlizzard, TChobanian, Hde Jesus, RDing, FDong, SGude, CKim, DTang, HWalsh, SPio, BJiang, J Inhibitors of the renal outer medullary potassium channel US Patent US9062070 Publication Date 6/23/2015
 
ATP-sensitive inward rectifier potassium channel 1
Name:ATP-sensitive inward rectifier potassium channel 1
Type:Enzyme
Mol. Mass.:44976.27
Organism:Rattus norvegicus (Rat)
Description:P35560
Residue:391
BDBM163766
NameBDBM163766
Synonyms:US9062070, 21
TypeSmall organic molecule
Emp. Form.C24H22F2N8O2
Mol. Mass.492.4807
SMILESFc1ccc([C@H]2CN3CCN(C[C@@H]3CO2)C(=O)C2CCc3nc(ccc23)-n2cnnn2)c(F)c1[N+]#[C-]