Reaction Details
TargetATP-sensitive inward rectifier potassium channel 1
LigandBDBM163798
Substrate/Competitorn/a
Meas. Tech.Electrophysiology Assay
pH7.4±n/a
IC50 110±n/a nM
Commentsextracted
Citation Pasternak, ABlizzard, TChobanian, Hde Jesus, RDing, FDong, SGude, CKim, DTang, HWalsh, SPio, BJiang, J Inhibitors of the renal outer medullary potassium channel US Patent US9062070 Publication Date 6/23/2015
 
ATP-sensitive inward rectifier potassium channel 1
Name:ATP-sensitive inward rectifier potassium channel 1
Type:Enzyme
Mol. Mass.:44976.27
Organism:Rattus norvegicus (Rat)
Description:P35560
Residue:391
BDBM163798
NameBDBM163798
Synonyms:US9062070, 53 | US9062070, 54
TypeSmall organic molecule
Emp. Form.C25H25N7O4
Mol. Mass.487.5105
SMILESO=C(C1CCc2cc(ncc12)-n1cnnn1)N1CCN2C[C@H](OC[C@@H]2C1)c1ccc2C(=O)OCc2c1