Reaction Details
TargetATP-sensitive inward rectifier potassium channel 1
LigandBDBM163833
Substrate/Competitorn/a
Meas. Tech.Electrophysiology Assay
pH7.4±n/a
IC50 100±n/a nM
Commentsextracted
Citation Pasternak, ABlizzard, TChobanian, Hde Jesus, RDing, FDong, SGude, CKim, DTang, HWalsh, SPio, BJiang, J Inhibitors of the renal outer medullary potassium channel US Patent US9062070 Publication Date 6/23/2015
 
ATP-sensitive inward rectifier potassium channel 1
Name:ATP-sensitive inward rectifier potassium channel 1
Type:Enzyme
Mol. Mass.:44976.27
Organism:Rattus norvegicus (Rat)
Description:P35560
Residue:391
BDBM163833
NameBDBM163833
Synonyms:US9062070, 88
TypeSmall organic molecule
Emp. Form.C27H28FN7O4
Mol. Mass.533.5541
SMILESC[C@H]1Cc2c(F)c(ccc2C(=O)O1)[C@@H]1CN2CCN(C[C@H]2CO1)C(=O)C1CCc2nc(ccc12)-n1cnnn1