Reaction Details
TargetIsocitrate dehydrogenase [NADP] cytoplasmic [R132H]
LigandBDBM287883
Substrate/Competitorn/a
Meas. Tech.R132H IDH1 Enzymatic Assay
pH7±n/a
Temperature298.15±n/a K
IC50 3.00±n/a nM
Commentsextracted
Citation Fischer, CBogen, SLChilders, MLFradera Llinas, FXKim, AJLampe, JWMachacek, MRMcMasters, DRParker, Jr., DLSciammetta, NShao, PPSloman, DLSun, WUjjainwalla, FHuang, C Tricyclic compounds as inhibitors of mutant IDH enzymes US Patent US10086000 Publication Date 10/2/2018
 
Isocitrate dehydrogenase [NADP] cytoplasmic [R132H]
Name:Isocitrate dehydrogenase [NADP] cytoplasmic [R132H]
Type:Protein
Mol. Mass.:46641.74
Organism:Homo sapiens (Human)
Description:Human IDH1 R132H (SEQ ID No. 2 in patent). First three are removed. Google patent parsed wrong.
Residue:414
BDBM287883
NameBDBM287883
Synonyms:8-(1,2-dimethyl-1H- imidazol-5-yl)-6-(6,7,8,9- tetrahydro-5H- benzo[7]annulen-7- ylcarbonyl)-6,11-dihydro- 5H-pyrido[2,3-b] [1,5]benzodiazepine US10508108, Example 100
TypeSmall organic molecule
Emp. Form.C29H29N5O
Mol. Mass.463.5735
SMILESCc1ncc(-c2ccc3Nc4ncccc4CN(C(=O)C4CCc5ccccc5CC4)c3c2)n1C