Reaction Details
TargetIsocitrate dehydrogenase [NADP] cytoplasmic [R132H]
LigandBDBM287889
Substrate/Competitorn/a
Meas. Tech.R132H IDH1 Enzymatic Assay
pH7±n/a
Temperature298.15±n/a K
IC50 3.00±n/a nM
Commentsextracted
Citation Fischer, CBogen, SLChilders, MLFradera Llinas, FXKim, AJLampe, JWMachacek, MRMcMasters, DRParker, Jr., DLSciammetta, NShao, PPSloman, DLSun, WUjjainwalla, FHuang, C Tricyclic compounds as inhibitors of mutant IDH enzymes US Patent US10086000 Publication Date 10/2/2018
 
Isocitrate dehydrogenase [NADP] cytoplasmic [R132H]
Name:Isocitrate dehydrogenase [NADP] cytoplasmic [R132H]
Type:Protein
Mol. Mass.:46641.74
Organism:Homo sapiens (Human)
Description:Human IDH1 R132H (SEQ ID No. 2 in patent). First three are removed. Google patent parsed wrong.
Residue:414
BDBM287889
NameBDBM287889
Synonyms:1-{4-[6-(6,7,8,9-tetrahydro- 5H-benzo[7]annulen-7- ylcarbonyl)-6,11-dihydro- 5H-pyrido[2,3-b] [1,5]benzodiazepin-8- yl]pyridin-2-yl}pyrrolidin- 3-ol US10508108, Example 106
TypeSmall organic molecule
Emp. Form.C33H33N5O2
Mol. Mass.531.6474
SMILESOC1CCN(C1)c1cc(ccn1)-c1ccc2Nc3ncccc3CN(C(=O)C3CCc4ccccc4CC3)c2c1