Reaction Details
TargetHigh affinity nerve growth factor receptor
LigandBDBM164885
Substrate/Competitorn/a
Meas. Tech.Inhibition Assay
pH7.5±n/a
Temperature298.15±n/a K
IC50 1±n/a nM
Commentsextracted
Citation Kane, Jr., JLMatthews, GMetz, MKothe, MLiu, JScholte, A Tropomyosin-related kinase (TRK) inhibitors US Patent US9067914 Publication Date 6/30/2015
 
High affinity nerve growth factor receptor
Name:High affinity nerve growth factor receptor
Type:n/a
Mol. Mass.:87498.18
Organism:Homo sapiens (Human)
Description:P04629
Residue:796
BDBM164885
NameBDBM164885
Synonyms:US10166239, Ex. 3-1 US9067914, Ex. 3-1
TypeSmall organic molecule
Emp. Form.C27H27N5O3
Mol. Mass.469.535
SMILESCOc1ccc(COc2ccc(Cn3c(N)nc4cc(ccc34)-c3cnn(C)c3)cc2OC)cc1