Reaction Details
TargetHigh affinity nerve growth factor receptor
LigandBDBM164902
Substrate/Competitorn/a
Meas. Tech.Inhibition Assay
pH7.5±n/a
Temperature298.15±n/a K
IC50 0.5±n/a nM
Commentsextracted
Citation Kane, Jr., JLMatthews, GMetz, MKothe, MLiu, JScholte, A Tropomyosin-related kinase (TRK) inhibitors US Patent US9067914 Publication Date 6/30/2015
 
High affinity nerve growth factor receptor
Name:High affinity nerve growth factor receptor
Type:n/a
Mol. Mass.:87498.18
Organism:Homo sapiens (Human)
Description:P04629
Residue:796
BDBM164902
NameBDBM164902
Synonyms:US10166239, Ex. 3-16 US9067914, Ex. 3-16
TypeSmall organic molecule
Emp. Form.C29H30N5O4P
Mol. Mass.543.5534
SMILESCOc1ccc(COc2ccc(Cn3c(N)nc4cc(cnc34)-c3ccc(nc3)P(C)(C)=O)cc2OC)cc1