Reaction Details
TargetBDNF/NT-3 growth factors receptor
LigandBDBM164961
Substrate/Competitorn/a
Meas. Tech.Inhibition Assay
pH7.5±n/a
Temperature298.15±n/a K
IC50 1±n/a nM
Commentsextracted
Citation Kane, Jr., JLMatthews, GMetz, MKothe, MLiu, JScholte, A Tropomyosin-related kinase (TRK) inhibitors US Patent US9067914 Publication Date 6/30/2015
 
BDNF/NT-3 growth factors receptor
Name:BDNF/NT-3 growth factors receptor
Type:Enzyme
Mol. Mass.:91996.87
Organism:Homo sapiens (Human)
Description:Q16620
Residue:822
BDBM164961
NameBDBM164961
Synonyms:US10166239, Ex. 3-52 US9067914, Ex. 3-52
TypeSmall organic molecule
Emp. Form.C26H23F3N6O2
Mol. Mass.508.495
SMILESCOc1cc(ccc1OCc1ccc(nc1)C(F)(F)F)C(C)n1cnc2cc(cnc12)-c1cnn(C)c1