Reaction Details
TargetBDNF/NT-3 growth factors receptor
LigandBDBM164964
Substrate/Competitorn/a
Meas. Tech.Inhibition Assay
pH7.5±n/a
Temperature298.15±n/a K
IC50 1±n/a nM
Commentsextracted
Citation Kane, Jr., JLMatthews, GMetz, MKothe, MLiu, JScholte, A Tropomyosin-related kinase (TRK) inhibitors US Patent US9067914 Publication Date 6/30/2015
 
BDNF/NT-3 growth factors receptor
Name:BDNF/NT-3 growth factors receptor
Type:Enzyme
Mol. Mass.:91996.87
Organism:Homo sapiens (Human)
Description:Q16620
Residue:822
BDBM164964
NameBDBM164964
Synonyms:US10166239, Ex. 3-55 US9067914, Ex. 3-55
TypeSmall organic molecule
Emp. Form.C26H24F3N5O3
Mol. Mass.511.4957
SMILESCOc1cc(ccc1OCc1ccc(nc1)C(F)(F)F)C(C)n1c(N)nc2cc(cnc12)C#CCCO