Reaction Details
TargetBeta-secretase 2
LigandBDBM165911
Substrate/Competitorn/a
Meas. Tech.ELISA Assay
IC50 21±n/a nM
Citation Hilpert, HRogers-Evans, MRombach, D 1,4 thiazepines/sulfones as BACE1 and/or BACE2 inhibitors US Patent US9067924 Publication Date 6/30/2015
 
Beta-secretase 2
Name:Beta-secretase 2
Type:Enzyme
Mol. Mass.:55787.27
Organism:Mus musculus (Mouse)
Description:Q9JL18
Residue:514
BDBM165911
NameBDBM165911
Synonyms:US9067924, 5
TypeSmall organic molecule
Emp. Form.C19H20F2N4OS
Mol. Mass.390.45
SMILESCC1SCC[C@](C)(N=C1N)c1cc(NC(=O)c2ccc(F)cn2)ccc1F