Reaction Details
TargetBeta-secretase 1
LigandBDBM165907
Substrate/Competitorn/a
Meas. Tech.ELISA Assay
IC50 6.3±n/a nM
Citation Hilpert, HRogers-Evans, MRombach, D 1,4 thiazepines/sulfones as BACE1 and/or BACE2 inhibitors US Patent US9067924 Publication Date 6/30/2015
 
Beta-secretase 1
Name:Beta-secretase 1
Type:Enzyme
Mol. Mass.:55739.56
Organism:Mus musculus (Mouse)
Description:P56818
Residue:501
BDBM165907
NameBDBM165907
Synonyms:US9067924, 1
TypeSmall organic molecule
Emp. Form.C18H18ClFN4OS
Mol. Mass.392.878
SMILESC[C@]1(CCSCC(N)=N1)c1cc(NC(=O)c2ccc(Cl)cn2)ccc1F