Reaction Details
TargetBeta-secretase 1
LigandBDBM165914
Substrate/Competitorn/a
Meas. Tech.ELISA Assay
IC50 30±n/a nM
Citation Hilpert, HRogers-Evans, MRombach, D 1,4 thiazepines/sulfones as BACE1 and/or BACE2 inhibitors US Patent US9067924 Publication Date 6/30/2015
 
Beta-secretase 1
Name:Beta-secretase 1
Type:Enzyme
Mol. Mass.:55739.56
Organism:Mus musculus (Mouse)
Description:P56818
Residue:501
BDBM165914
NameBDBM165914
Synonyms:US9067924, 8
TypeSmall organic molecule
Emp. Form.C19H20ClFN4O3S
Mol. Mass.438.904
SMILESCC1C(N)=N[C@@](C)(CCS1(=O)=O)c1cc(NC(=O)c2ccc(Cl)cn2)ccc1F