Reaction Details
Target5-hydroxytryptamine receptor 6
LigandBDBM166347
Substrate/Competitorn/a
Meas. Tech.Radioligand Binding Assay
pH7.5±n/a
Temperature298.15±n/a K
Ki 0.23±n/a nM
Commentsextracted
Citation Guzzo, PRHenderson, AJIsherwood, MLee, CYGhosh, AZhao, H Benzofuro[3,2-c] pyridines and related analogs as serotonin sub-type 6 (5-HT6) modulators for the treatment of obesity, metabolic syndrome, cognition and schizophrenia US Patent US9067949 Publication Date 6/30/2015
 
5-hydroxytryptamine receptor 6
Name:5-hydroxytryptamine receptor 6
Type:G Protein-Coupled Receptor (GPCR)
Mol. Mass.:46968.43
Organism:Homo sapiens (Human)
Description:P50406
Residue:440
BDBM166347
NameBDBM166347
Synonyms:US9067949, 204
TypeSmall organic molecule
Emp. Form.C20H17NO3S2
Mol. Mass.383.484
SMILESCc1cc(cc2c3CNCCc3oc12)S(=O)(=O)c1ccc2sccc2c1