Reaction Details
TargetNeutrophil elastase
LigandBDBM166437
Substrate/Competitorn/a
Meas. Tech.Release Assay
Temperature310.15±n/a K
IC50 170±n/a nM
Commentsextracted
Citation Hsieh, PHwang, TWang, WWang, T Oxime-based compound, pharmaceutical composition containing the same and method for preparing the same US Patent US9073833 Publication Date 7/7/2015
 
Neutrophil elastase
Name:Neutrophil elastase
Type:Enzyme
Mol. Mass.:28532.38
Organism:Homo sapiens (Human)
Description:P08246
Residue:267
BDBM166437
NameBDBM166437
Synonyms:US9073833, 5
TypeSmall organic molecule
Emp. Form.C20H24N2O5S
Mol. Mass.404.48
SMILESCO\N=C(/C)c1ccccc1NS(=O)(=O)c1ccc(OC(=O)C(C)(C)C)cc1