Reaction Details
TargetCaspase-1
LigandBDBM34233
Substrate/Competitorn/a
Meas. Tech.Inhibition Assay
pH7.5±n/a
Temperature298.15±n/a K
IC50 4.04e+3± 2.9e+2 nM
Commentsextracted
Citation Kawarski, MHagerman, TKKarver, CE Lazaroids U83836E and U74389G are potent, time-dependent inhibitors of caspase-1. Chem Biol Drug Des86:1049-54 (2015) 
 
Caspase-1
Name:Caspase-1
Type:Enzyme
Mol. Mass.:45154.13
Organism:Homo sapiens (Human)
Description:P29466
Residue:404
BDBM34233
NameBDBM34233
Synonyms:2-Phenyl-benzo[d]isoselenazol-3-one 2-phenyl-1,2-benzisoselazol-3(2H)-one 2-phenylbenzo[d][1,2]selenazol-3(2H)-one EBSELEN MLS000028488 cid_3194 | med.21724, Compound 153
TypeSmall organic molecule
Emp. Form.C13H9NOSe
Mol. Mass.274.18
SMILESO=c1n([se]c2ccccc12)-c1ccccc1