Reaction Details
TargetArachidonate 5-lipoxygenase-activating protein
LigandBDBM167014
Substrate/Competitorn/a
Meas. Tech.Homogeneous Time Resolved Fluorescence Assay
Ki 1±n/a nM
Citation Eccles, WFitzgerald, AEHack, MDHawryluk, NAJones, WMKeith, JMKrawczuk, PLebsack, ADLiu, JMani, NSMcClure, KJMeduna, SPRosen, MD Flap modulators US Patent US9073876 Publication Date 7/7/2015
 
Arachidonate 5-lipoxygenase-activating protein
Name:Arachidonate 5-lipoxygenase-activating protein
Type:Enzyme
Mol. Mass.:18159.90
Organism:Homo sapiens (Human)
Description:P20292
Residue:161
BDBM167014
NameBDBM167014
Synonyms:US9073876, 100 | US9732093, Compound 100
TypeSmall organic molecule
Emp. Form.C19H19FN6O2
Mol. Mass.382.3916
SMILESCOc1nc(N)cc(Oc2c(F)c(ccc2C2CCC2)-c2cnc(N)cn2)n1