Reaction Details
TargetArachidonate 5-lipoxygenase-activating protein
LigandBDBM167016
Substrate/Competitorn/a
Meas. Tech.Homogeneous Time Resolved Fluorescence Assay
Ki 2±n/a nM
Citation Eccles, WFitzgerald, AEHack, MDHawryluk, NAJones, WMKeith, JMKrawczuk, PLebsack, ADLiu, JMani, NSMcClure, KJMeduna, SPRosen, MD Flap modulators US Patent US9073876 Publication Date 7/7/2015
 
Arachidonate 5-lipoxygenase-activating protein
Name:Arachidonate 5-lipoxygenase-activating protein
Type:Enzyme
Mol. Mass.:18159.90
Organism:Homo sapiens (Human)
Description:P20292
Residue:161
BDBM167016
NameBDBM167016
Synonyms:US9073876, 102 | US9732093, Compound 102
TypeSmall organic molecule
Emp. Form.C20H16F4N4O
Mol. Mass.404.3609
SMILESNc1cnc(cn1)-c1ccc(C2CCC2)c(Oc2cccc(n2)C(F)(F)F)c1F