Reaction Details
TargetAurora kinase A
LigandBDBM167508
Substrate/Competitorn/a
Meas. Tech.Radioactive Assay
IC50 23±n/a nM
Citation Carry, JCheve, MClerc, FCombeau, CGontier, SKrick, ALachaud, SSchio, L Anti-cancer compound and pharmaceutical composition containing the same US Patent US9073917 Publication Date 7/7/2015
 
Aurora kinase A
Name:Aurora kinase A
Type:Serine/threonine-protein kinase
Mol. Mass.:45830.98
Organism:Homo sapiens (Human)
Description:O14965
Residue:403
BDBM167508
NameBDBM167508
Synonyms:US9073917, 5- comparative
TypeSmall organic molecule
Emp. Form.C23H19N5O2
Mol. Mass.397.4293
SMILESO=C1CCCC2=C1C(c1c[nH]nc1N2)c1cccc(Oc2nc3ccccc3[nH]2)c1