Reaction Details
TargetRibosomal protein S6 kinase alpha-3
LigandBDBM168046
Substrate/Competitorn/a
Meas. Tech.Kinase Glo Assay
pH7.5±n/a
IC50 19±n/a nM
Commentsextracted
Citation Boyer, SJBurke, JGuo, XKirrane, Jr., TMSnow, RJZhang, Y Heterocyclic compounds containing a pyrrolopyridine or benzimidazole core US Patent US9073926 Publication Date 7/7/2015
 
Ribosomal protein S6 kinase alpha-3
Name:Ribosomal protein S6 kinase alpha-3
Type:Serine/threonine-protein kinase
Mol. Mass.:83740.03
Organism:Homo sapiens (Human)
Description:The human RSK2 sequence differed from the Genbank entry NM_004586 at one residue, V45G. The protein was cloned and purified from baculovirus expression system.
Residue:740
BDBM168046
NameBDBM168046
Synonyms:US9073926, 80
TypeSmall organic molecule
Emp. Form.C16H15N5O3
Mol. Mass.325.322
SMILESCc1cc(NC(=O)c2ccc3cc4C(=O)NCCCn4c3n2)no1