Reaction Details
TargetRibosomal protein S6 kinase alpha-3
LigandBDBM168048
Substrate/Competitorn/a
Meas. Tech.Kinase Glo Assay
pH7.5±n/a
IC50 5.2±n/a nM
Commentsextracted
Citation Boyer, SJBurke, JGuo, XKirrane, Jr., TMSnow, RJZhang, Y Heterocyclic compounds containing a pyrrolopyridine or benzimidazole core US Patent US9073926 Publication Date 7/7/2015
 
Ribosomal protein S6 kinase alpha-3
Name:Ribosomal protein S6 kinase alpha-3
Type:Serine/threonine-protein kinase
Mol. Mass.:83740.03
Organism:Homo sapiens (Human)
Description:The human RSK2 sequence differed from the Genbank entry NM_004586 at one residue, V45G. The protein was cloned and purified from baculovirus expression system.
Residue:740
BDBM168048
NameBDBM168048
Synonyms:US9073926, 82
TypeSmall organic molecule
Emp. Form.C17H17N5O3
Mol. Mass.339.3486
SMILESCC1CCNC(=O)c2cc3ccc(nc3n12)C(=O)Nc1cc(C)on1