Reaction Details
TargetGag-Pol polyprotein
LigandBDBM168608
Substrate/Competitorn/a
Meas. Tech.Inhibition Assay
IC50 0.019±n/a nM
Citation Boyd, MJMolinaro, CRoy, ATruong, V HIV protease inhibitors US Patent US9079834 Publication Date 7/14/2015
 
Gag-Pol polyprotein
Name:Gag-Pol polyprotein
Type:Protein
Mol. Mass.:162074.74
Organism:Human immunodeficiency virus type 1 group M subtype B (isolate HXB2)
Description:P04585
Residue:1435
BDBM168608
NameBDBM168608
Synonyms:US9079834, 2
TypeSmall organic molecule
Emp. Form.C35H45F2N3O7S
Mol. Mass.689.81
SMILESCCCCCN([C@H](CO)CCC(F)(F)CNC(=O)[C@@H](NC(=O)OC)C(c1ccccc1)c1ccccc1)S(=O)(=O)c1ccc(CO)cc1