Reaction Details
TargetGag-Pol polyprotein
LigandBDBM168610
Substrate/Competitorn/a
Meas. Tech.Inhibition Assay
IC50 0.39±n/a nM
Citation Boyd, MJMolinaro, CRoy, ATruong, V HIV protease inhibitors US Patent US9079834 Publication Date 7/14/2015
 
Gag-Pol polyprotein
Name:Gag-Pol polyprotein
Type:Protein
Mol. Mass.:162074.74
Organism:Human immunodeficiency virus type 1 group M subtype B (isolate HXB2)
Description:P04585
Residue:1435
BDBM168610
NameBDBM168610
Synonyms:US9079834, 5
TypeSmall organic molecule
Emp. Form.C34H36F2N6O6S2
Mol. Mass.726.813
SMILESCOC(=O)N[C@@H](C(c1ccccc1)c1ccccc1)C(=O)NCC(F)(F)CC[C@@H](CO)N(Cc1cn[nH]c1)S(=O)(=O)c1ccc2ncsc2c1