Reaction Details
TargetGag-Pol polyprotein
LigandBDBM168611
Substrate/Competitorn/a
Meas. Tech.Inhibition Assay
IC50 2.73±n/a nM
Citation Boyd, MJMolinaro, CRoy, ATruong, V HIV protease inhibitors US Patent US9079834 Publication Date 7/14/2015
 
Gag-Pol polyprotein
Name:Gag-Pol polyprotein
Type:Protein
Mol. Mass.:162074.74
Organism:Human immunodeficiency virus type 1 group M subtype B (isolate HXB2)
Description:P04585
Residue:1435
BDBM168611
NameBDBM168611
Synonyms:US9079834, 6
TypeSmall organic molecule
Emp. Form.C36H40F4N4O6S2
Mol. Mass.764.85
SMILESCOC(=O)N[C@@H](C(c1ccccc1)c1ccccc1)C(=O)NCC(F)(F)CC[C@@H](CO)N(C1CCC(F)(F)CC1)S(=O)(=O)c1ccc2ncsc2c1