Reaction Details
TargetArachidonate 5-lipoxygenase-activating protein
LigandBDBM168972
Substrate/Competitorn/a
Meas. Tech.Homogeneous Time Resolved Fluorescence Assay
Ki 1±n/a nM
Citation Bacani, GMEccles, WFitzgerald, AEGoldberg, SDHack, MDHawryluk, NAJones, WMKeith, JMKrawczuk, PLebsack, ADLee-Dutra, ALiu, JMcClure, KJMeduna, SPPippel, DJRosen, MDSales, ZS Flap modulators US Patent US9079866 Publication Date 7/14/2015
 
Arachidonate 5-lipoxygenase-activating protein
Name:Arachidonate 5-lipoxygenase-activating protein
Type:Enzyme
Mol. Mass.:18159.90
Organism:Homo sapiens (Human)
Description:P20292
Residue:161
BDBM168972
NameBDBM168972
Synonyms:US9079866, 373 US9884878, Compound 373
TypeSmall organic molecule
Emp. Form.C22H21FN4O2S
Mol. Mass.424.491
SMILESCCN(CC)S(=O)(=O)c1ccccc1-c1ccc(c(F)c1)-c1cnc2[nH]ccc2n1